{"text_format":"1","workbook":"xlsx","n_sheets":6,"sheets":["Bordro","Hesap","Bord","Banka","List","oeb"],"not_rendered":{"charts":0,"images":4,"macros":1,"external_links":0,"defined_names":6,"comments":0,"pivot_tables":0},"unopened":[],"bounds":{"document_bytes":16777216,"sheet_cells":100000,"rows_first":2000,"rows_last":500,"rows_between":2000,"halvings":0,"cell_chars":16384,"cell_head_chars":4096},"cells_cut":0,"cells_raw":0,"read":"whole","date_system":"1900"}

{"sheet":"Bordro","index":0,"n_rows":128,"n_cols":104,"rows_kept":128,"cut":false,"hidden":false,"merged":[[5,19,5,20],[2,25,2,27],[3,25,3,27],[2,21,2,24],[3,21,3,24],[4,25,4,27],[4,22,4,24],[5,21,5,22],[2,19,2,20],[3,19,3,20],[4,19,4,20],[5,31,6,31],[5,27,6,27],[5,28,6,28],[5,29,6,29],[5,30,6,30],[27,1,27,26],[5,1,5,2],[5,3,5,4],[5,8,6,8],[5,7,6,7],[5,5,6,5],[5,6,6,6],[5,11,5,12],[5,23,6,23],[5,9,6,9],[5,10,6,10],[5,25,5,26],[5,13,5,14],[5,15,5,16],[5,17,5,18],[5,24,6,24],[3,59,4,59],[3,58,4,58],[3,60,4,60],[3,61,4,61],[2,1,4,8],[2,9,2,11],[3,9,3,11],[4,9,4,11],[2,12,2,18],[3,12,3,18],[4,12,4,13],[4,14,4,18]]}
[]
[]
[null,"ÇEŞİTLİ ÖDEMELER BORDROSU",null,null,null,null,null,null,null,"Okul/Kurum Türü",null,null,"13.67-İl/İlçe Milli Eğitim Müdürlükleri",null,null,null,null,null,null,"Düzenleyen",null,"Ziya KILINÇ",null,null,null,"Şef",null,null,null,null,null,null,null,null,null,null,null,null,null,null,null,null,null,null,null,null,null,null,null,null,null,null,null,null,null,null,null,null,null,null,null,null,null,null,null,null,null,null,null,null,null,null,null,null,null,null,null,null,null,null,null,null,null,null,null,null,null,null,null,null,null,null,null,null,null,null,1,1]
[null,null,null,null,null,null,null,null,null,"Okul/Kurum Adı",null,null,"İlçe Milli Eğitim Müdürlüğü",null,null,null,null,null,null,"Onaylayan",null,"Abdurrahman BUCAK",null,null,null,"Şube Müdürü",null,null,null,null,null,null,null,null,null,null,null,null,null,null,null,null,null,null,null,null,null,null,null,null,null,null,null,null,null,null,null,null,"Yazdır",{"$f":"BJ6","v":1},{"$f":"SUM(BJ8:BJ27)","v":0},{"$f":"BH4+BI4","v":1},null,null,null,null,null,null,null,null,null,null,null,null,null,null,null,null,null,null,null,null,null,null,null,null,null,null,null,null,null,null,null,null,null,null,1,2]
[null,null,null,null,null,null,null,null,null,"Kurum Vergi/ IBAN No",null,null,8390532151,null,"TR450006701000000045782341",null,null,null,null,"Damga Vergisi",null,7.59,"Yazdır",null,null,"Bordro",null,null,null,null,null,null,null,null,null,null,null,null,null,null,null,null,null,null,null,null,null,null,null,null,null,null,null,null,null,null,null,null,null,null,null,null,null,null,null,null,null,null,null,null,null,null,null,null,null,null,null,null,null,null,null,null,null,null,null,null,null,null,null,null,null,null,null,null,null,null,1,3]
[null,"Ödemenin Ait\nOlduğu Dönem",null,"Ödeme Dönemine\nAit Katsayılar",null,"Adı Soyadı","Kimlik No","Unvanı","İBAN\nNumarası","Sendika Üye No\n(İkr. Ödenecekse)","Vergi Oranı","Drece\nKademe",null,"Yan Ödeme\nPuanı",null,"Ek Tazminat\nPuanı",null,"Ek Ödeme Puanı",null,"Toplu Söz.\nİkramiyesi",null,"Diğer Tazm.\nÖdemesi",null,"İlave Ödeme\n(375 KHK)","Aile\nYardımı","Çocuk\nYardımı",null,"Toplam\nTutar","Gelir\nVergisi","Damga\nVergisi","Kesinti\nToplamı","Ödenecek\nTutar",null,null,null,null,null,null,null,null,null,null,null,null,null,null,"K. Türü",{"$f":"IF(M3=\"\",0,1)","v":1},"K. Adı",{"$f":"IF(M4=\"\",0,1)","v":1},"Iban",{"$f":"IF(O5=\"\",0,1)","v":1},"Vergi No",{"$f":"IF(M5=\"\",0,1)","v":1},"Düzenleyen",{"$f":"IF(OR(V3=\"\",Z3=\"\"),0,1)","v":1},"Onaylayan",{"$f":"IF(OR(V4=\"\",V4=\"\"),0,1)","v":1},"Damga",{"$f":"IF(V5=\"\",0,1)","v":1},"Kontrol",{"$f":"IF((AV6+AX6+AZ6+BB6+BD6+BF6+BH6)=7,1,0)","v":1},null,null,null,null,null,null,null,null,null,null,null,null,null,null,null,null,null,null,null,null,null,null,null,null,null,null,null,null,null,null,null,null,null,null,1,4]
{"$rows_left_out":123}
{"sheet":"Hesap","index":1,"n_rows":44,"n_cols":31,"rows_kept":44,"cut":false,"hidden":true,"merged":[[41,0,43,0],[41,5,43,5],[41,6,43,6],[30,5,31,6],[32,0,34,0],[32,5,34,5],[32,6,34,6],[35,0,37,0],[35,5,37,5],[35,6,37,6],[4,11,4,14],[29,2,29,6],[4,15,4,18],[4,23,4,25],[38,0,40,0],[38,5,40,5],[38,6,40,6],[4,3,4,6],[4,7,4,10],[4,19,4,22],[4,2,5,2],[4,1,5,1],[4,0,5,0]]}
[null,null,null,{"$f":"Bordro!CU7","v":"✓"},null,null,null,null,null,null,null,null,null,null,null,null,null,null,null,null,null,null,null,null,null,null,{"$f":"AB1-1","v":2020},2021,2022,{"$f":"AE1-1","v":2023},{"$f":"YEAR(TODAY())","v":2024}]
[]
[]
[]
["Adı Soyadı","Maaş","Yan Ödeme","Yan Ödeme",null,null,null,"Ek Tazm",null,null,null,"Ek Ödeme",null,null,null,"Top. Söz. İkramiyesi",null,null,null,"Diğer Tazminat",null,null,null,"Diğer Ödemeler"]
[null,null,null,"Ödenecek","Ödenen","Fark","Tutar","Ödenecek","Ödenen","Fark","Tutar","Ödenecek","Ödenen","Fark","Tutar","Ödenecek","Ödenen","Fark","Tutar","Ödenecek","Ödenen","Fark","Tutar","İlave Ödeme","Aile","Çocuk","Toplam","Gelir","Damga","Kesinti","Ödenecek"]
{"$rows_left_out":39}
{"sheet":"Bord","index":2,"n_rows":32,"n_cols":10,"rows_kept":32,"cut":false,"hidden":true,"merged":[[7,0,7,1],[8,0,8,1],[9,0,9,1],[20,0,20,1],[21,0,21,1],[12,0,12,1],[14,0,14,1],[15,0,15,1],[16,0,16,1],[17,0,17,1],[13,0,13,1],[29,2,29,3],[30,2,30,3],[31,2,31,3],[28,2,28,3],[22,0,22,1],[2,1,2,2],[26,0,26,8],[0,0,0,8],[25,0,25,2],[10,0,10,1],[11,0,11,1],[3,8,4,8],[3,0,4,1],[5,0,5,1],[3,2,4,2],[6,0,6,1],[23,0,23,1],[24,0,24,1],[18,0,18,1],[19,0,19,1],[1,1,1,2]]}
["ÇEŞİTLİ ÖDEMELER BORDROSU"]
["Okul Türü",{"$f":"Bordro!M3","v":"13.67-İl/İlçe Milli Eğitim Müdürlükleri"}]
["Birimi",{"$f":"Bordro!M4","v":"İlçe Milli Eğitim Müdürlüğü"}]
["İlgili Ay/Yıl\nKimlik No/Adı Soyadı\nUnvanı - D/K\nHesap/IBAN No",null,"Maaş Kts.\nYan Öd. Kts.\nSend. Üye No\nVergi Oranı","Yan Ödeme","Ek Tazminat","Ek Ödeme","Top. Söz. İkr.","Diğer Ödemeler","Toplam Tutar\nGelir Vergisi\nDamga Vergisi\nÖdenecek Tutar",1]
[null,null,null,"Ödenen Göst.\nÖdenecek Göst.\nGösterge Fark\nÖdeme Tutarı","Ödenen Göst.\nÖdenecek Göst.\nGösterge Fark\nÖdeme Tutarı","Ödenen Göst.\nÖdenecek Göst.\nGösterge Fark\nÖdeme Tutarı","Ödenen Göst.\nÖdenecek Göst.\nGösterge Fark\nÖdeme Tutarı","İlave Ödeme\nDiğer Tazminat\nAile Yardımı\nÇocuk Yardımı",null,1]
[{"$f":"Bordro!B8&\"/\"&Bordro!C8&\"                                                                                                    \"&Bordro!G8&\" - \"&Bordro!F8&\"                                                                                                    \"&Bordro!H8&\" - \"&Bordro!L8&\"/\"&Bordro!M8&\"                                                                                                    \"&Bordro!I8","v":"/                                                                                                     -                                                                                                      - /                                                                                                    "},null,{"$f":"TEXT(Bordro!D8,\"#.##0,00000000\")&\"                                                  \"&TEXT(Bordro!E8,\"#.##0,00000000\")&\"                                                  \"&IF(Bordro!J8=\"\",0,Bordro!J8)&\"                                                  \"&Bordro!K8","v":"0,00000000                                                  0,00000000                                                  0                                                  "},{"$f":"Hesap!E7&\"                                                                                                    \"&Hesap!D7&\"                                                                                                    \"&Hesap!F7&\"                                                                                                    \"&TEXT(Hesap!G7,\"#.##0,00\")","v":"0                                                                                                    0                                                                                                    0                                                                                                    0,00"},{"$f":"Hesap!I7&\"                                                                                                    \"&Hesap!H7&\"                                                                                                    \"&Hesap!J7&\"                                                                                                    \"&TEXT(Hesap!K7,\"#.##0,00\")","v":"0                                                                                                    0                                                                                                    0                                                                                                    0,00"},{"$f":"Hesap!M7&\"                                                                                                    \"&Hesap!L7&\"                                                                                                    \"&Hesap!N7&\"                                                                                                    \"&TEXT(Hesap!O7,\"#.##0,00\")","v":"0                                                                                                    0                                                                                                    0                                                                                                    0,00"},{"$f":"Hesap!Q7&\"                                                                                                    \"&Hesap!P7&\"                                                                                                    \"&Hesap!R7&\"                                                                                                    \"&TEXT(Hesap!S7,\"#.##0,00\")","v":"0                                                                                                    0                                                                                                    0                                                                                                    0,00"},{"$f":"TEXT(Hesap!X7,\"#.##0,00\")&\"                                                                                                    \"&TEXT(Hesap!W7,\"#.##0,00\")&\"                                                                                                    \"&TEXT(Hesap!Y7,\"#.##0,00\")&\"                                                                                                    \"&TEXT(Hesap!Z7,\"#.##0,00\")","v":"0,00                                                                                                    0,00                                                                                                    0,00                                                                                                    0,00"},{"$f":"TEXT(Hesap!AA7,\"#.##0,00\")&\"                                                                                                    \"&TEXT(Hesap!AB7,\"#.##0,00\")&\"                                                                                                    \"&TEXT(Hesap!AC7,\"#.##0,00\")&\"                                                                                                    \"&TEXT(Hesap!AE7,\"#.##0,00\")","v":"0,00                                                                                                    0,00                                                                                                    0,00                                                                                                    0,00"},{"$f":"IF(Hesap!AE7=0,0,1)","v":0}]
{"$rows_left_out":27}
{"sheet":"Banka","index":3,"n_rows":30,"n_cols":15,"rows_kept":30,"cut":false,"hidden":true,"merged":[[14,2,14,3],[15,2,15,3],[16,2,16,3],[17,2,17,3],[18,2,18,3],[19,2,19,3],[20,2,20,3],[21,2,21,3],[22,2,22,3],[23,2,23,3],[10,2,10,3],[11,2,11,3],[12,2,12,3],[13,2,13,3],[4,2,4,3],[5,2,5,3],[6,2,6,3],[7,2,7,3],[8,2,8,3],[9,2,9,3],[26,0,26,1],[27,0,27,1],[28,0,28,1],[29,0,29,1],[26,2,26,3],[27,2,27,3],[28,2,28,3],[29,2,29,3],[20,4,20,5],[21,4,21,5],[22,4,22,5],[23,4,23,5],[24,0,24,5],[0,0,0,6],[3,4,3,5],[4,4,4,5],[5,4,5,5],[6,4,6,5],[2,0,2,1],[2,2,2,6],[3,2,3,3],[7,4,7,5],[8,4,8,5],[9,4,9,5],[10,4,10,5],[11,4,11,5],[17,4,17,5],[18,4,18,5],[19,4,19,5],[12,4,12,5],[13,4,13,5],[14,4,14,5],[15,4,15,5],[16,4,16,5]]}
["BANKA ÖDEME NÜSHASI",null,null,null,null,null,null,1]
[null,null,null,null,null,null,null,1]
["Birim Adı",null,{"$f":"Bordro!M4","v":"İlçe Milli Eğitim Müdürlüğü"},null,null,null,null,1]
["S. No","Kimlik No","Adı Soyadı",null,"IBAN No",null,"Tutar",1,null,null,"Kimlik No","Adı Soyadı","IBAN No","Ücret","Tutar"]
[{"$f":"IF(H5=1,1,0)","v":{"$error":"#N/A"}},{"$f":"List!J1","v":22807836354},{"$f":"INDEX($K$4:$O$24,MATCH(B5,$K$4:$K$24,),MATCH($C$4,$K$4:$O$4,))","v":{"$error":"#N/A"}},null,{"$f":"INDEX($K$4:$O$24,MATCH(B5,$K$4:$K$24,),MATCH($E$4,$K$4:$O$4,))","v":{"$error":"#N/A"}},null,{"$f":"INDEX($K$4:$O$24,MATCH(B5,$K$4:$K$24,),MATCH($G$4,$K$4:$O$4,))","v":{"$error":"#N/A"}},{"$f":"IF(G5=0,0,1)","v":{"$error":"#N/A"}},null,null,{"$f":"Bordro!G8","v":0},{"$f":"Bordro!F8","v":0},{"$f":"Bordro!I8","v":0},{"$f":"Hesap!AE7","v":0},{"$f":"SUMIF($K$5:$K$24,K5,$N$5:$N$24)","v":0}]
[{"$f":"IF(H6=1,A5+1,A5)","v":{"$error":"#N/A"}},{"$f":"List!J2","v":0},{"$f":"INDEX($K$4:$O$24,MATCH(B6,$K$4:$K$24,),MATCH($C$4,$K$4:$O$4,))","v":0},null,{"$f":"INDEX($K$4:$O$24,MATCH(B6,$K$4:$K$24,),MATCH($E$4,$K$4:$O$4,))","v":0},null,{"$f":"INDEX($K$4:$O$24,MATCH(B6,$K$4:$K$24,),MATCH($G$4,$K$4:$O$4,))","v":0},{"$f":"IF(G6=0,0,1)","v":0},null,null,{"$f":"Bordro!G9","v":0},{"$f":"Bordro!F9","v":0},{"$f":"Bordro!I9","v":0},{"$f":"Hesap!AE8","v":0},{"$f":"SUMIF($K$5:$K$24,K6,$N$5:$N$24)","v":0}]
{"$rows_left_out":25}
{"sheet":"List","index":4,"n_rows":20,"n_cols":10,"rows_kept":20,"cut":false,"hidden":true,"merged":[]}
[{"$f":"Bordro!G8","v":0},{"$f":"Bordro!F8","v":0},{"$f":"Bordro!I8","v":0},{"$f":"IF(J1=0,0,IF(J1=\"\",0,COUNTIF($A$1:$A$20,J1)))","v":0},{"$f":"COUNTA(Bordro!G8:G27)","v":0},{"$f":"IF(D1=E1,1,2)","v":1},null,null,null,22807836354]
[{"$f":"Bordro!G9","v":0},{"$f":"Bordro!F9","v":0},{"$f":"Bordro!I9","v":0},{"$f":"IF(J2=0,0,IF(J2=\"\",0,COUNTIF($A$1:$A$20,J2)))","v":0},null,null,null,null,null,0]
[{"$f":"Bordro!G10","v":0},{"$f":"Bordro!F10","v":0},{"$f":"Bordro!I10","v":0},{"$f":"IF(J3=0,0,IF(J3=\"\",0,COUNTIF($A$1:$A$20,J3)))","v":0}]
[{"$f":"Bordro!G11","v":0},{"$f":"Bordro!F11","v":0},{"$f":"Bordro!I11","v":0},{"$f":"IF(J4=0,0,IF(J4=\"\",0,COUNTIF($A$1:$A$20,J4)))","v":0}]
[{"$f":"Bordro!G12","v":0},{"$f":"Bordro!F12","v":0},{"$f":"Bordro!I12","v":0},0]
[{"$f":"Bordro!G13","v":0},{"$f":"Bordro!F13","v":0},{"$f":"Bordro!I13","v":0},0]
{"$rows_left_out":15}
{"sheet":"oeb","index":5,"n_rows":20,"n_cols":15,"rows_kept":20,"cut":false,"hidden":true,"merged":[[19,5,19,6],[19,7,19,8],[17,7,17,8],[15,7,15,8],[16,7,16,8],[18,5,18,6],[18,7,18,8],[12,0,13,1],[15,5,15,6],[16,5,16,6],[17,5,17,6],[10,2,10,3],[11,2,11,3],[0,0,0,8],[1,0,1,8],[5,0,5,8],[2,4,2,5],[7,2,7,3],[6,2,6,3],[9,2,9,3],[3,4,3,5],[2,0,2,2],[3,0,3,2],[8,2,8,3]]}
["ÖDEME EMRİ BELGESİ",null,null,null,null,null,null,null,null,{"$f":"List!F1","v":1},"S. No","Genel Müdürlük","Zamlar ve Tazminatlar","Sosyal Haklar","Ödenekler"]
["(ÖRNEKTİR)",null,null,null,null,null,null,null,null,null,1,"13.67-İl/İlçe Milli Eğitim Müdürlükleri","98.900.9006.306.13.67.01.01.01.20.01","98.900.9006.306.13.67.01.01.01.40.01","98.900.9006.306.13.67.01.01.01.30.01"]
["Adı Soyadı/Unvanı",null,null,"VKN/TCKN","IBAN No",null,"Brüt Tutar","Kesinti Tutarı","Net Tutar",null,2,"13.68-Okul Öncesi Okulları","40.149.422.291.13.68.01.01.01.20.01","40.149.422.291.13.68.01.01.01.40.01","40.149.422.291.13.68.01.01.01.30.01"]
[{"$f":"IF(J1=2,Bordro!M4,Banka!C5)","v":{"$error":"#N/A"}},null,null,{"$f":"IF(J1=2,Bordro!M5,Banka!B5)","v":22807836354},{"$f":"IF(J1=2,Bordro!O5,Banka!E5)","v":{"$error":"#N/A"}},null,{"$f":"Hesap!AA27","v":0},{"$f":"Hesap!AD27","v":0},{"$f":"Hesap!AE27","v":0},null,3,"13.68-İlk ve Orta Okullar","40.149.423.292.13.68.01.01.01.20.01","40.149.423.292.13.68.01.01.01.40.01 ","40.149.423.292.13.68.01.01.01.30.01 "]
[null,null,null,null,null,null,null,null,null,null,4,"13.69-Genel Ortaöğretim Okulları","37.147.409.276.13.69.01.01.01.20.01","37.147.409.276.13.69.01.01.01.40.01","37.147.409.276.13.69.01.01.01.30.01"]
["ÖDEME EMRİ",null,null,null,null,null,null,null,null,null,5,"13.70-Mesleki ve Teknik Eğitim Okulları","37.266.410.8453.13.70.01.01.01.20.01","37.266.410.8453.13.70.01.01.01.40.01","37.266.410.8453.13.70.01.01.01.30.01"]
{"$rows_left_out":14}